EAS build: فشل Gradle
نص الخطأ
Gradle build failed with unknown error. See logs for the "Run gradlew" phase. Error: Gradle build failed with unknown error.
السبب
ينكسر البناء في مرحلة «Run gradlew» على سحابة EAS. السبب غالبًا عدم توافق مكتبة أو JDK أو إعدادات.
الحل خطوة بخطوة
- افتح سجل مرحلة «Run gradlew» في صفحة EAS وابحث عن أول سطر
FAILURE:. - شغّل
npx expo-doctor؛ يعرض عدم توافق الإصدارات. - أعد إنتاج الخطأ محليًا بـ
prebuildو./gradlew assembleRelease. - أعد الإرسال مع
--clear-cacheلمسح الذاكرة المؤقتة القديمة. - طابق
imageوإصدار Node فيeas.jsonمع إصدار SDK.
أوامر للمثال
eas build --platform android --profile production --clear-cache npx expo-doctor cd android && ./gradlew assembleRelease --stacktrace # yerli təkrar
كيف لا يتكرر
بعد كل ترقية SDK ابنِ محليًا أولًا ثم أرسل إلى السحابة.
المؤلف والترخيص: Nibras Code
- APK لا يُثبَّت
- ما هو parse error؟
- ضاع ملف keystore
- التواقيع غير متطابقة
- خطأ في اسم الحزمة
- ملف APK تالف
- Play Protect يحظر التطبيق
- تبدو الحزمة غير صالحة
- لا توجد مساحة كافية
- الهاتف غير متوافق
- النسخة الأقدم لا تُثبَّت
- XAPK لا يُثبَّت
- فشل Gradle sync
- تعذّر حل الاعتمادية (Could not resolve)
- خطأ Duplicate class
- Manifest merger failed
- حد Dex: 65536 دالة
- R8: Missing class
- عدم توافق إصدار JDK
- SDK location not found
- تعارض minSdkVersion
- قيمة compileSdk منخفضة جدًا
- خطأ expo prebuild
- Metro: Unable to resolve module
- Hermes: خطأ JS في release فقط
- شاشة بيضاء في release
- شاشة حمراء: لا يتصل بـ Metro
- عدم توافق إصدار Expo SDK
- خطأ Capacitor sync
- Capacitor: شاشة بيضاء
- EAS: خطأ keystore وcredentials
- Keystore tampered / كلمة المرور خاطئة
- اسم alias أو كلمة مرور المفتاح خاطئة
- Play: التوقيع بمفتاح خاطئ
- INSTALL_FAILED_UPDATE_INCOMPATIBLE
- INSTALL_FAILED_VERSION_DOWNGRADE
- INSTALL_FAILED_INSUFFICIENT_STORAGE
- INSTALL_FAILED_NO_MATCHING_ABIS
- خطأ في تحليل الحزمة (Parse error)
- خطأ «App not installed»
- تثبيت ملف AAB على الهاتف
- adb: الجهاز «unauthorized»
- adb: الجهاز غير موجود
- عدم تطابق إصدار خادم adb
- Activity class does not exist
- Play: مستوى targetSdk منخفض
- Play: رفض بسبب سياسة الأذونات
- Play: شرط 64-bit
- Play: versionCode مستخدم من قبل
- انهيار ClassNotFound / NoSuchMethod
- انهيار OutOfMemoryError
- CLEARTEXT communication not permitted
- SecurityException: الإذن مرفوض