EAS build: ошибка Gradle
Текст ошибки
Gradle build failed with unknown error. See logs for the "Run gradlew" phase. Error: Gradle build failed with unknown error.
Причина
Сборка падает на этапе «Run gradlew» в облаке EAS. Обычно причина в несовместимости библиотеки, JDK или настроек.
Решение по шагам
- Открой лог этапа «Run gradlew» на странице EAS и найди первую строку
FAILURE:. - Запусти
npx expo-doctor: он покажет несовместимые версии. - Воспроизведи ошибку локально через
prebuildи./gradlew assembleRelease. - Отправь снова с
--clear-cache, чтобы сбросить старый кэш. - Приведи
imageи версию Node вeas.jsonв соответствие с SDK.
Примеры команд
eas build --platform android --profile production --clear-cache npx expo-doctor cd android && ./gradlew assembleRelease --stacktrace # yerli təkrar
Как не повторить
После каждого обновления SDK сначала собирай локально, потом отправляй в облако.
Автор и лицензия: Nibras Code
- APK не устанавливается
- Что такое parse error?
- Потерян keystore
- Подписи не совпадают
- Ошибка имени пакета
- Файл APK повреждён
- Play Protect блокирует приложение
- Пакет кажется недействительным
- Не хватает памяти
- Телефон не подходит
- Старая версия не устанавливается
- XAPK не устанавливается
- Gradle sync не удался
- Не удалось разрешить зависимость (Could not resolve)
- Ошибка Duplicate class
- Manifest merger failed
- Лимит dex: 65536 методов
- R8: Missing class
- Несовместимая версия JDK
- SDK location not found
- Конфликт minSdkVersion
- compileSdk слишком низкий
- Ошибка expo prebuild
- Metro: Unable to resolve module
- Hermes: ошибка JS только в release
- Белый экран в release
- Красный экран: нет связи с Metro
- Несовпадение версий Expo SDK
- Ошибка Capacitor sync
- Capacitor: белый экран
- EAS: ошибка keystore и credentials
- Keystore tampered / неверный пароль
- Неверный alias или пароль ключа
- Play: подписано не тем ключом
- INSTALL_FAILED_UPDATE_INCOMPATIBLE
- INSTALL_FAILED_VERSION_DOWNGRADE
- INSTALL_FAILED_INSUFFICIENT_STORAGE
- INSTALL_FAILED_NO_MATCHING_ABIS
- Ошибка разбора пакета (Parse error)
- Ошибка «App not installed»
- Установка AAB-файла на телефон
- adb: устройство «unauthorized»
- adb: устройство не найдено
- Несовпадение версии сервера adb
- Activity class does not exist
- Play: слишком низкий targetSdk
- Play: отклонение по политике разрешений
- Play: требование 64-bit
- Play: versionCode уже использован
- Краш ClassNotFound / NoSuchMethod
- Краш OutOfMemoryError
- CLEARTEXT communication not permitted
- SecurityException: разрешение отклонено