EAS build: Gradle hatası
Hata metni
Gradle build failed with unknown error. See logs for the "Run gradlew" phase. Error: Gradle build failed with unknown error.
Neden
EAS bulutta derlerken «Run gradlew» aşamasında kırılır. Neden çoğu zaman kütüphane, JDK ya da yapılandırma uyumsuzluğudur.
Adım adım çözüm
- EAS sayfasında «Run gradlew» aşamasının logunu aç, ilk
FAILURE:satırını bul. npx expo-doctorçalıştır: sürüm uyumsuzluklarını gösterir.- Aynı hatayı yerelde
prebuildve./gradlew assembleReleaseile tekrarla. - Önbelleği temizlemek için
--clear-cacheile yeniden gönder. eas.jsoniçindekiimageve Node sürümünü SDK'ya uydur.
Örnek komutlar
eas build --platform android --profile production --clear-cache npx expo-doctor cd android && ./gradlew assembleRelease --stacktrace # yerli təkrar
Tekrarlanmasın diye
Her SDK güncellemesinden sonra önce yerelde dene, sonra buluta gönder.
Yazar ve lisans: Nibras Code
- APK kurulmuyor
- Parse error nedir?
- Keystore kayboldu
- İmzalar uyuşmuyor
- Paket adı hatası
- APK dosyası bozuldu
- Play Protect engelliyor
- Paket geçersiz görünüyor
- Depolama yetmiyor
- Telefon uyumlu değil
- Eski sürüm kurulmuyor
- XAPK kurulmuyor
- Gradle sync başarısız
- Bağımlılık çözülemedi (Could not resolve)
- Duplicate class hatası
- Manifest merger failed
- Dex sınırı: 65536 metot
- R8: Missing class
- JDK sürümü uyumsuz
- SDK location not found
- minSdkVersion çakışması
- compileSdk çok düşük
- expo prebuild hatası
- Metro: Unable to resolve module
- Hermes: yalnızca release'te JS hatası
- Release'te beyaz ekran
- Kırmızı ekran: Metro'ya bağlanamıyor
- Expo SDK uyumsuzluğu
- Capacitor sync hatası
- Capacitor: beyaz ekran
- EAS: keystore ve credentials hatası
- Keystore tampered / parola yanlış
- Anahtar alias'ı ya da parolası yanlış
- Play: yanlış anahtarla imzalanmış
- INSTALL_FAILED_UPDATE_INCOMPATIBLE
- INSTALL_FAILED_VERSION_DOWNGRADE
- INSTALL_FAILED_INSUFFICIENT_STORAGE
- INSTALL_FAILED_NO_MATCHING_ABIS
- Parse hatası (paket ayrıştırılamadı)
- «App not installed» hatası
- AAB dosyasını telefona kurmak
- adb: cihaz «unauthorized»
- adb: cihaz bulunamıyor
- adb server sürüm uyumsuzluğu
- Activity class does not exist
- Play: targetSdk seviyesi düşük
- Play: izin politikası reddi
- Play: 64-bit şartı
- Play: versionCode zaten kullanılmış
- ClassNotFound / NoSuchMethod çökmesi
- OutOfMemoryError çökmesi
- CLEARTEXT communication not permitted
- SecurityException: izin verilmedi