expo prebuild error
Error text
Error: [android.dangerous]: withAndroidDangerousBaseMod: Cannot read properties of undefined Prebuild failed. Config plugin error.
Cause
prebuild breaks while running the plugins from app.json. Usually a plugin option is wrong or its version does not match the SDK.
Step-by-step fix
- Find the plugin name in the error and compare
app.jsonwith that plugin's options. - Fix mismatched packages with
npx expo install --check. - Delete the
androidandiosfolders and runnpx expo prebuild --clean. - Switch plugins off one by one to find the culprit.
- Check the JSON syntax of
app.json; even a trailing comma causes this.
Example commands
npx expo prebuild --clean --platform android npx expo config --type introspect npx expo install --check
How to prevent it
Do not commit native folders; regenerate them with prebuild every time.
Author and license: Nibras Code
- APK will not install
- What is a parse error?
- The keystore is lost
- The signatures do not match
- Package name error
- The APK file is damaged
- Play Protect blocks the app
- The package appears to be invalid
- Not enough storage
- The phone is not compatible
- An older version will not install
- XAPK will not install
- Gradle sync failed
- Could not resolve a dependency
- Duplicate class error
- Manifest merger failed
- Dex limit: 65536 methods
- R8: Missing class
- JDK version mismatch
- SDK location not found
- minSdkVersion conflict
- compileSdk is too low
- EAS build: Gradle failure
- Metro: Unable to resolve module
- Hermes: JS error only in release
- White screen in release
- Red screen: cannot reach Metro
- Expo SDK mismatch
- Capacitor sync error
- Capacitor: white screen
- EAS: keystore and credentials error
- Keystore was tampered with / wrong password
- Wrong key alias or password
- Play: signed with the wrong key
- INSTALL_FAILED_UPDATE_INCOMPATIBLE
- INSTALL_FAILED_VERSION_DOWNGRADE
- INSTALL_FAILED_INSUFFICIENT_STORAGE
- INSTALL_FAILED_NO_MATCHING_ABIS
- Parse error (problem parsing the package)
- "App not installed" error
- Installing an AAB file on a phone
- adb: device "unauthorized"
- adb: device not found
- adb server version mismatch
- Activity class does not exist
- Play: targetSdk level too low
- Play: permissions policy rejection
- Play: 64-bit requirement
- Play: versionCode already used
- ClassNotFound / NoSuchMethod crash
- OutOfMemoryError crash
- CLEARTEXT communication not permitted
- SecurityException: permission denied